{"text_format":"1","workbook":"xlsx","n_sheets":2,"sheets":["Kalkulator","BAZA_LIBOR_WIBOR_KURS"],"not_rendered":{"charts":1,"images":0,"macros":0,"external_links":0,"defined_names":1,"comments":0,"pivot_tables":0},"unopened":[],"bounds":{"document_bytes":16777216,"sheet_cells":100000,"rows_first":2000,"rows_last":500,"rows_between":2000,"halvings":0,"cell_chars":16384,"cell_head_chars":4096},"cells_cut":0,"cells_raw":0,"read":"whole","date_system":"1900"}

{"sheet":"Kalkulator","index":0,"n_rows":491,"n_cols":14,"rows_kept":491,"cut":false,"hidden":false,"merged":[]}
[null,"Kredyt w CHF",null,null,"Aktualny status kredytu",null,null,"Saldo kapitału w PLN",null,null,"Kredyt po restrukturyzacji"]
[null,"Marża kredytu",0.01]
[null,"Kwota kredytu PLN",300000,null,"Rok",2016,null,"Kurs otwarcia",null,null,"Kapitał do spłaty",{"$f":"H6","v":286336.47911424865}]
[null,"Okres kredytowania ",360,null,"Miesiąc","styczeń",null,{"$f":"F8*C8","v":234560.10679865439},{"$f":"H4/F8","v":2.027765},null,"Liczba rat",{"$f":"F9","v":272}]
[null,"Rok",2008,null,"Data",{"$f":"DATE(F3,VLOOKUP(F4,BAZA_LIBOR_WIBOR_KURS!I2:J13,2,FALSE),1)","v":"2016-01-01"},null,"Kurs sprawiedliwy",null,null,"WIBOR 3M",1.7299999999999999E-2]
[null,"Miesiąc","sierpień",null,"Saldo kapitału PLN",{"$f":"VLOOKUP(F5,B12:N491,13,FALSE)","v":286336.47911424865},null,{"$f":"F6","v":286336.47911424865},{"$f":"H6/F8","v":2.4753701662896552},null,"marża",{"$f":"C2","v":0.01}]
[null,"Data uruchomienia",{"$f":"DATE(C5,VLOOKUP(C6,BAZA_LIBOR_WIBOR_KURS!I2:J13,2,FALSE),1)","v":"2008-08-01"},null,"Kurs CHF",{"$f":"VLOOKUP(F5,BAZA_LIBOR_WIBOR_KURS!C2:F145,4,FALSE)","v":4.0999999999999996},null,"Kurs aktualny"]
[null,"Kurs CHF",{"$f":"VLOOKUP(C7,BAZA_LIBOR_WIBOR_KURS!C2:F145,4,FALSE)","v":2.027765},null,"Saldo kapitału CHF",{"$f":"VLOOKUP(F5,B12:G491,6,FALSE)","v":115674.20623132089},null,{"$f":"F8*F7","v":474264.24554841558},{"$f":"H8/F8","v":4.0999999999999996},null,"Rata miesięczna",{"$f":"PMT((L6+L5)/12,L4,-L3)","v":1412.9538418365237}]
[null,"Kwota kredytu CHF",{"$f":"ROUND(C3/C8,2)","v":147946.14000000001},null,"Liczba rat do końca",{"$f":"C4-((2016-C5)*12)+IF(C6=\"styczeń\",1,IF(C6=\"luty\",2,IF(C6=\"marzec\",3,IF(C6=\"kwiecień\",4,IF(C6=\"maj\",5,IF(C6=\"czerwiec\",6,IF(C6=\"lipiec\",7,IF(C6=\"sierpień\",8,IF(C6=\"wrzesień\",9,IF(C6=październik,10,IF(C6=\"listopad\",11,IF(C6=\"grudzień\",12,0))))))))))))","v":272}]
[]
["Nr raty","Data","LIBOR_3M_CHF","Marża","odsetki_CHF","kapitał_CHF","Saldo kapitału_CHF","kurs_CHF","WIBOR_3M","Marża","Wpłata w PLN","Odsetki_PLN","Kapitał_PLN","Saldo kapitału_PLN"]
[1,{"$f":"DATE(C5,VLOOKUP(C6,BAZA_LIBOR_WIBOR_KURS!I2:J13,2,FALSE)+1,1)","v":"2008-09-01"},{"$f":"VLOOKUP(B12,BAZA_LIBOR_WIBOR_KURS!$C$2:$F$145,2,FALSE)","v":2.7789999999999999E-2},{"$f":"C2","v":0.01},{"$f":"IPMT((C12+D12)/12,1,$C$4,-C9)","v":465.90705255},{"$f":"PPMT((C12+D12)/12,1,$C$4,-C9)","v":221.69142110688932},{"$f":"$C$9-SUM($F$12:F12)","v":147724.44857889312},{"$f":"VLOOKUP(B12,BAZA_LIBOR_WIBOR_KURS!$C$2:$F$145,4,FALSE)","v":2.1158181818181823},{"$f":"VLOOKUP(B12,BAZA_LIBOR_WIBOR_KURS!$C$2:$F$145,3,FALSE)","v":6.5581818181818199E-2},0.02,{"$f":"IF(A12>$C$4,\"_\",IF(B12>$F$5,0,H12*(E12+F12)))","v":1454.8333523536769},{"$f":"ROUND(C3*(I12+J12)/12,2)","v":2139.5500000000002},{"$f":"IFERROR(K12-L12,\"_\")","v":-684.71664764632328},{"$f":"IF(A12>$C$4,\"_\",$C$3-SUM($M$12:M12))","v":300684.71664764633}]
[{"$f":"A12+1","v":2},{"$f":"IF(A13>$C$4,\"_\",DATE(YEAR(B12),MONTH(B12)+1,1))","v":"2008-10-01"},{"$f":"IF(A13>$C$4,\"_\",IFERROR(VLOOKUP(B13,BAZA_LIBOR_WIBOR_KURS!$C$2:$F$145,2,FALSE),C12))","v":2.998E-2},{"$f":"IF(A13>$C$4,\"_\",D12)","v":0.01},{"$f":"IF(A13>$C$4,\"_\",IPMT((C13+D13)/12,1,$C$4-A12,-G12))","v":492.16862118201226},{"$f":"IF(A13>$C$4,\"_\",PPMT((C13+D13)/12,1,$C$4-A12,-G12))","v":213.93790697342754},{"$f":"IF(A13>$C$4,\"_\",$C$9-SUM($F$12:F13))","v":147510.51067191971},{"$f":"IF(A13>$C$4,\"_\",IFERROR(VLOOKUP(B13,BAZA_LIBOR_WIBOR_KURS!$C$2:$F$145,4,FALSE),H12))","v":2.3559260869565213},{"$f":"IF(A13>$C$4,\"_\",IFERROR(VLOOKUP(B13,BAZA_LIBOR_WIBOR_KURS!$C$2:$F$145,3,FALSE),I12))","v":6.7969565217391323E-2},{"$f":"IF(A13>$C$4,\"_\",J12)","v":0.02},1663.5347898517,{"$f":"IF(A13>$C$4,\"_\",IF(N12<0,0,ROUND(N12*(I13+J13)/12,2)))","v":2204.2600000000002},{"$f":"IFERROR(K13-L13,\"_\")","v":-540.72521014830022},{"$f":"IF(A13>$C$4,\"_\",$C$3-SUM($M$12:M13))","v":301225.44185779465}]
[{"$f":"A13+1","v":3},"2008-11-01",{"$f":"IF(A14>$C$4,\"_\",IFERROR(VLOOKUP(B14,BAZA_LIBOR_WIBOR_KURS!$C$2:$F$145,2,FALSE),C13))","v":1.967E-2},0.01,364.7197376363215,256.71580918720787,{"$f":"IF(A14>$C$4,\"_\",$C$9-SUM($F$12:F14))","v":147253.79486273249},{"$f":"IF(A14>$C$4,\"_\",IFERROR(VLOOKUP(B14,BAZA_LIBOR_WIBOR_KURS!$C$2:$F$145,4,FALSE),H13))","v":2.4589999999999996},{"$f":"IF(A14>$C$4,\"_\",IFERROR(VLOOKUP(B14,BAZA_LIBOR_WIBOR_KURS!$C$2:$F$145,3,FALSE),I13))","v":6.7394736842105257E-2},0.02,1528.1100096390587,2193.79,-665.67999036094125,{"$f":"IF(A14>$C$4,\"_\",$C$3-SUM($M$12:M14))","v":301891.12184815557}]
[4,"2008-12-01",{"$f":"IF(A15>$C$4,\"_\",IFERROR(VLOOKUP(B15,BAZA_LIBOR_WIBOR_KURS!$C$2:$F$145,2,FALSE),C14))","v":9.1299999999999992E-3},0.01,234.74709131033939,306.49562032739203,{"$f":"IF(A15>$C$4,\"_\",$C$9-SUM($F$12:F15))","v":146947.2992424051},{"$f":"IF(A15>$C$4,\"_\",IFERROR(VLOOKUP(B15,BAZA_LIBOR_WIBOR_KURS!$C$2:$F$145,4,FALSE),H14))","v":2.6059285714285716},{"$f":"IF(A15>$C$4,\"_\",IFERROR(VLOOKUP(B15,BAZA_LIBOR_WIBOR_KURS!$C$2:$F$145,3,FALSE),I14))","v":6.3785714285714265E-2},0.02,1410.4398463342397,2107.85,-697.41015366576016,{"$f":"IF(A15>$C$4,\"_\",$C$3-SUM($M$12:M15))","v":302588.53200182132}]
[5,"2009-01-01",{"$f":"IF(A16>$C$4,\"_\",IFERROR(VLOOKUP(B16,BAZA_LIBOR_WIBOR_KURS!$C$2:$F$145,2,FALSE),C15))","v":5.6899999999999997E-3},0.01,192.13359375944466,324.39741975213724,{"$f":"IF(A16>$C$4,\"_\",$C$9-SUM($F$12:F16))","v":146622.90182265296},{"$f":"IF(A16>$C$4,\"_\",IFERROR(VLOOKUP(B16,BAZA_LIBOR_WIBOR_KURS!$C$2:$F$145,4,FALSE),H15))","v":2.8255238095238098},{"$f":"IF(A16>$C$4,\"_\",IFERROR(VLOOKUP(B16,BAZA_LIBOR_WIBOR_KURS!$C$2:$F$145,3,FALSE),I15))","v":5.5061904761904756E-2},0.02,1459.4706770344394,1892.74,-433.2693229655606,{"$f":"IF(A16>$C$4,\"_\",$C$3-SUM($M$12:M16))","v":303021.80132478691}]
[6,"2009-02-01",{"$f":"IF(A17>$C$4,\"_\",IFERROR(VLOOKUP(B17,BAZA_LIBOR_WIBOR_KURS!$C$2:$F$145,2,FALSE),C16))","v":5.0600000000000003E-3},0.01,184.01174178742946,328.08058829481803,{"$f":"IF(A17>$C$4,\"_\",$C$9-SUM($F$12:F17))","v":146294.82123435815},{"$f":"IF(A17>$C$4,\"_\",IFERROR(VLOOKUP(B17,BAZA_LIBOR_WIBOR_KURS!$C$2:$F$145,4,FALSE),H16))","v":3.1191750000000003},{"$f":"IF(A17>$C$4,\"_\",IFERROR(VLOOKUP(B17,BAZA_LIBOR_WIBOR_KURS!$C$2:$F$145,3,FALSE),I16))","v":4.6875000000000014E-2},0.02,1597.3055936842945,1688.72,-91.414406315705492,{"$f":"IF(A17>$C$4,\"_\",$C$3-SUM($M$12:M17))","v":303113.21573110257}]
[7,"2009-03-01",{"$f":"IF(A18>$C$4,\"_\",IFERROR(VLOOKUP(B18,BAZA_LIBOR_WIBOR_KURS!$C$2:$F$145,2,FALSE),C17))","v":4.3600000000000002E-3},0.01,175.06613607711529,332.13441705016214,{"$f":"IF(A18>$C$4,\"_\",$C$9-SUM($F$12:F18))","v":145962.68681730799},{"$f":"IF(A18>$C$4,\"_\",IFERROR(VLOOKUP(B18,BAZA_LIBOR_WIBOR_KURS!$C$2:$F$145,4,FALSE),H17))","v":3.0715227272727272},{"$f":"IF(A18>$C$4,\"_\",IFERROR(VLOOKUP(B18,BAZA_LIBOR_WIBOR_KURS!$C$2:$F$145,3,FALSE),I17))","v":4.2990909090909087E-2},0.02,1557.8780262157309,1591.11,-33.23197378426903,{"$f":"IF(A18>$C$4,\"_\",$C$3-SUM($M$12:M18))","v":303146.44770488684}]
[8,"2009-04-01",{"$f":"IF(A19>$C$4,\"_\",IFERROR(VLOOKUP(B19,BAZA_LIBOR_WIBOR_KURS!$C$2:$F$145,2,FALSE),C18))","v":4.0099999999999997E-3},0.01,170.41143685920707,334.3603585765174,{"$f":"IF(A19>$C$4,\"_\",$C$9-SUM($F$12:F19))","v":145628.32645873146},{"$f":"IF(A19>$C$4,\"_\",IFERROR(VLOOKUP(B19,BAZA_LIBOR_WIBOR_KURS!$C$2:$F$145,4,FALSE),H18))","v":2.9235857142857142},{"$f":"IF(A19>$C$4,\"_\",IFERROR(VLOOKUP(B19,BAZA_LIBOR_WIBOR_KURS!$C$2:$F$145,3,FALSE),I18))","v":4.2047619047619049E-2},0.02,1475.7436101102348,1567.46,-91.716389889765196,{"$f":"IF(A19>$C$4,\"_\",$C$3-SUM($M$12:M19))","v":303238.16409477661}]
[9,"2009-05-01",{"$f":"IF(A20>$C$4,\"_\",IFERROR(VLOOKUP(B20,BAZA_LIBOR_WIBOR_KURS!$C$2:$F$145,2,FALSE),C19))","v":4.0200000000000001E-3},0.01,170.14242807928463,334.69847951099888,{"$f":"IF(A20>$C$4,\"_\",$C$9-SUM($F$12:F20))","v":145293.62797922047},{"$f":"IF(A20>$C$4,\"_\",IFERROR(VLOOKUP(B20,BAZA_LIBOR_WIBOR_KURS!$C$2:$F$145,4,FALSE),H19))","v":2.9161999999999995},{"$f":"IF(A20>$C$4,\"_\",IFERROR(VLOOKUP(B20,BAZA_LIBOR_WIBOR_KURS!$C$2:$F$145,3,FALSE),I19))","v":4.5155000000000001E-2},0.02,1472.2170547147846,1646.46,-174.24294528521546,{"$f":"IF(A20>$C$4,\"_\",$C$3-SUM($M$12:M20))","v":303412.40704006184}]
[10,"2009-06-01",{"$f":"IF(A21>$C$4,\"_\",IFERROR(VLOOKUP(B21,BAZA_LIBOR_WIBOR_KURS!$C$2:$F$145,2,FALSE),C20))","v":3.9500000000000004E-3},0.01,168.90384252584383,335.45467221238818,{"$f":"IF(A21>$C$4,\"_\",$C$9-SUM($F$12:F21))","v":144958.17330700808},{"$f":"IF(A21>$C$4,\"_\",IFERROR(VLOOKUP(B21,BAZA_LIBOR_WIBOR_KURS!$C$2:$F$145,4,FALSE),H20))","v":2.9769428571428569},{"$f":"IF(A21>$C$4,\"_\",IFERROR(VLOOKUP(B21,BAZA_LIBOR_WIBOR_KURS!$C$2:$F$145,3,FALSE),I20))","v":4.5980952380952379E-2},0.02,1501.44647788916,1668.29,-166.84352211084001,{"$f":"IF(A21>$C$4,\"_\",$C$3-SUM($M$12:M21))","v":303579.25056217267}]
[11,"2009-07-01",{"$f":"IF(A22>$C$4,\"_\",IFERROR(VLOOKUP(B22,BAZA_LIBOR_WIBOR_KURS!$C$2:$F$145,2,FALSE),C21))","v":3.7299999999999998E-3},0.01,165.85630995876841,336.99194928999452,{"$f":"IF(A22>$C$4,\"_\",$C$9-SUM($F$12:F22))","v":144621.18135771807},{"$f":"IF(A22>$C$4,\"_\",IFERROR(VLOOKUP(B22,BAZA_LIBOR_WIBOR_KURS!$C$2:$F$145,4,FALSE),H21))","v":2.8288478260869567},{"$f":"IF(A22>$C$4,\"_\",IFERROR(VLOOKUP(B22,BAZA_LIBOR_WIBOR_KURS!$C$2:$F$145,3,FALSE),I21))","v":4.2582608695652162E-2},0.02,1422.4812050274734,1583.23,-160.74879497252664,{"$f":"IF(A22>$C$4,\"_\",$C$3-SUM($M$12:M22))","v":303739.99935714522}]
[12,"2009-08-01",{"$f":"IF(A23>$C$4,\"_\",IFERROR(VLOOKUP(B23,BAZA_LIBOR_WIBOR_KURS!$C$2:$F$145,2,FALSE),C22))","v":3.4299999999999999E-3},0.01,161.85520546951281,338.94354783955458,{"$f":"IF(A23>$C$4,\"_\",$C$9-SUM($F$12:F23))","v":144282.23780987854},{"$f":"IF(A23>$C$4,\"_\",IFERROR(VLOOKUP(B23,BAZA_LIBOR_WIBOR_KURS!$C$2:$F$145,4,FALSE),H22))","v":2.7103809523809521},{"$f":"IF(A23>$C$4,\"_\",IFERROR(VLOOKUP(B23,BAZA_LIBOR_WIBOR_KURS!$C$2:$F$145,3,FALSE),I22))","v":4.1590476190476171E-2},0.02,1357.3554019450235,1558.96,-201.60459805497658,{"$f":"IF(A23>$C$4,\"_\",$C$3-SUM($M$12:M23))","v":303941.60395520017}]
[13,"2009-09-01",{"$f":"IF(A24>$C$4,\"_\",IFERROR(VLOOKUP(B24,BAZA_LIBOR_WIBOR_KURS!$C$2:$F$145,2,FALSE),C23))","v":3.0100000000000001E-3},0.01,156.42599282554332,341.5197341583733,{"$f":"IF(A24>$C$4,\"_\",$C$9-SUM($F$12:F24))","v":143940.71807572016},{"$f":"IF(A24>$C$4,\"_\",IFERROR(VLOOKUP(B24,BAZA_LIBOR_WIBOR_KURS!$C$2:$F$145,4,FALSE),H23))","v":2.7480090909090906},{"$f":"IF(A24>$C$4,\"_\",IFERROR(VLOOKUP(B24,BAZA_LIBOR_WIBOR_KURS!$C$2:$F$145,3,FALSE),I23))","v":4.1772727272727253E-2},0.02,1368.3593845311391,1564.61,-196.25061546886081,{"$f":"IF(A24>$C$4,\"_\",$C$3-SUM($M$12:M24))","v":304137.85457066906}]
[14,"2009-10-01",{"$f":"IF(A25>$C$4,\"_\",IFERROR(VLOOKUP(B25,BAZA_LIBOR_WIBOR_KURS!$C$2:$F$145,2,FALSE),C24))","v":2.7299999999999998E-3},0.01,152.69711175865979,343.35726930795983,{"$f":"IF(A25>$C$4,\"_\",$C$9-SUM($F$12:F25))","v":143597.36080641218},{"$f":"IF(A25>$C$4,\"_\",IFERROR(VLOOKUP(B25,BAZA_LIBOR_WIBOR_KURS!$C$2:$F$145,4,FALSE),H24))","v":2.7826454545454542},{"$f":"IF(A25>$C$4,\"_\",IFERROR(VLOOKUP(B25,BAZA_LIBOR_WIBOR_KURS!$C$2:$F$145,3,FALSE),I24))","v":4.1836363636363609E-2},0.02,1380.3434686823878,1567.23,-186.88653131761225,{"$f":"IF(A25>$C$4,\"_\",$C$3-SUM($M$12:M25))","v":304324.74110198667}]
[15,"2009-11-01",{"$f":"IF(A26>$C$4,\"_\",IFERROR(VLOOKUP(B26,BAZA_LIBOR_WIBOR_KURS!$C$2:$F$145,2,FALSE),C25))","v":2.5500000000000002E-3},0.01,150.17890651003941,344.66522514892989,{"$f":"IF(A26>$C$4,\"_\",$C$9-SUM($F$12:F26))","v":143252.69558126325},{"$f":"IF(A26>$C$4,\"_\",IFERROR(VLOOKUP(B26,BAZA_LIBOR_WIBOR_KURS!$C$2:$F$145,4,FALSE),H25))","v":2.7600199999999999},{"$f":"IF(A26>$C$4,\"_\",IFERROR(VLOOKUP(B26,BAZA_LIBOR_WIBOR_KURS!$C$2:$F$145,3,FALSE),I25))","v":4.1915000000000022E-2},0.02,1365.7797002613886,1570.19,-204.41029973861146,{"$f":"IF(A26>$C$4,\"_\",$C$3-SUM($M$12:M26))","v":304529.15140172525}]
[16,"2009-12-01",{"$f":"IF(A27>$C$4,\"_\",IFERROR(VLOOKUP(B27,BAZA_LIBOR_WIBOR_KURS!$C$2:$F$145,2,FALSE),C26))","v":2.5200000000000001E-3},0.01,149.46031238978466,345.18283323700985,{"$f":"IF(A27>$C$4,\"_\",$C$9-SUM($F$12:F27))","v":142907.51274802626},{"$f":"IF(A27>$C$4,\"_\",IFERROR(VLOOKUP(B27,BAZA_LIBOR_WIBOR_KURS!$C$2:$F$145,4,FALSE),H26))","v":2.7561636363636364},{"$f":"IF(A27>$C$4,\"_\",IFERROR(VLOOKUP(B27,BAZA_LIBOR_WIBOR_KURS!$C$2:$F$145,3,FALSE),I26))","v":4.2322727272727262E-2},0.02,1363.3174509530938,1581.59,-218.27254904690608,{"$f":"IF(A27>$C$4,\"_\",$C$3-SUM($M$12:M27))","v":304747.42395077215}]
[17,"2010-01-01",{"$f":"IF(A28>$C$4,\"_\",IFERROR(VLOOKUP(B28,BAZA_LIBOR_WIBOR_KURS!$C$2:$F$145,2,FALSE),C27))","v":2.5000000000000001E-3},0.01,148.86199244586069,345.64755329833667,{"$f":"IF(A28>$C$4,\"_\",$C$9-SUM($F$12:F28))","v":142561.86519472793},{"$f":"IF(A28>$C$4,\"_\",IFERROR(VLOOKUP(B28,BAZA_LIBOR_WIBOR_KURS!$C$2:$F$145,4,FALSE),H27))","v":2.7545149999999996},{"$f":"IF(A28>$C$4,\"_\",IFERROR(VLOOKUP(B28,BAZA_LIBOR_WIBOR_KURS!$C$2:$F$145,3,FALSE),I27))","v":4.2370000000000005E-2},0.02,1362.1339613955774,1583.92,-221.78603860442263,{"$f":"IF(A28>$C$4,\"_\",$C$3-SUM($M$12:M28))","v":304969.2099893766}]
[18,"2010-02-01",{"$f":"IF(A29>$C$4,\"_\",IFERROR(VLOOKUP(B29,BAZA_LIBOR_WIBOR_KURS!$C$2:$F$145,2,FALSE),C28))","v":2.49E-3},0.01,148.38314135684601,346.05979424265604,{"$f":"IF(A29>$C$4,\"_\",$C$9-SUM($F$12:F29))","v":142215.80540048526},{"$f":"IF(A29>$C$4,\"_\",IFERROR(VLOOKUP(B29,BAZA_LIBOR_WIBOR_KURS!$C$2:$F$145,4,FALSE),H28))","v":2.7354799999999999},{"$f":"IF(A29>$C$4,\"_\",IFERROR(VLOOKUP(B29,BAZA_LIBOR_WIBOR_KURS!$C$2:$F$145,3,FALSE),I28))","v":4.1724999999999998E-2},0.02,1352.5387614737258,1568.69,-216.15123852627426,{"$f":"IF(A29>$C$4,\"_\",$C$3-SUM($M$12:M29))","v":305185.36122790287}]
[19,"2010-03-01",{"$f":"IF(A30>$C$4,\"_\",IFERROR(VLOOKUP(B30,BAZA_LIBOR_WIBOR_KURS!$C$2:$F$145,2,FALSE),C29))","v":2.49E-3},0.01,148.02295078767176,346.4199848118302,{"$f":"IF(A30>$C$4,\"_\",$C$9-SUM($F$12:F30))","v":141869.38541567343},{"$f":"IF(A30>$C$4,\"_\",IFERROR(VLOOKUP(B30,BAZA_LIBOR_WIBOR_KURS!$C$2:$F$145,4,FALSE),H29))","v":2.6885000000000003},{"$f":"IF(A30>$C$4,\"_\",IFERROR(VLOOKUP(B30,BAZA_LIBOR_WIBOR_KURS!$C$2:$F$145,3,FALSE),I29))","v":4.1291304347826095E-2},0.02,1329.3098323592612,1558.77,-229.46016764073875,{"$f":"IF(A30>$C$4,\"_\",$C$3-SUM($M$12:M30))","v":305414.82139554364}]
[20,"2010-04-01",{"$f":"IF(A31>$C$4,\"_\",IFERROR(VLOOKUP(B31,BAZA_LIBOR_WIBOR_KURS!$C$2:$F$145,2,FALSE),C30))","v":2.4399999999999999E-3},0.01,147.07126288091479,347.0405199463238,{"$f":"IF(A31>$C$4,\"_\",$C$9-SUM($F$12:F31))","v":141522.34489572712},{"$f":"IF(A31>$C$4,\"_\",IFERROR(VLOOKUP(B31,BAZA_LIBOR_WIBOR_KURS!$C$2:$F$145,4,FALSE),H30))","v":2.7024380952380951},{"$f":"IF(A31>$C$4,\"_\",IFERROR(VLOOKUP(B31,BAZA_LIBOR_WIBOR_KURS!$C$2:$F$145,3,FALSE),I30))","v":3.9219047619047605E-2},0.02,1335.306505218342,1507.2,-171.89349478165809,{"$f":"IF(A31>$C$4,\"_\",$C$3-SUM($M$12:M31))","v":305586.71489032527}]
[21,"2010-05-01",{"$f":"IF(A32>$C$4,\"_\",IFERROR(VLOOKUP(B32,BAZA_LIBOR_WIBOR_KURS!$C$2:$F$145,2,FALSE),C31))","v":1.9400000000000001E-3},0.01,140.81473317124849,350.00215842281591,{"$f":"IF(A32>$C$4,\"_\",$C$9-SUM($F$12:F32))","v":141172.34273730428},{"$f":"IF(A32>$C$4,\"_\",IFERROR(VLOOKUP(B32,BAZA_LIBOR_WIBOR_KURS!$C$2:$F$145,4,FALSE),H31))","v":2.8604000000000003},{"$f":"IF(A32>$C$4,\"_\",IFERROR(VLOOKUP(B32,BAZA_LIBOR_WIBOR_KURS!$C$2:$F$145,3,FALSE),I31))","v":3.8539999999999984E-2},0.02,1403.9326367156618,1490.75,-86.817363284338171,{"$f":"IF(A32>$C$4,\"_\",$C$3-SUM($M$12:M32))","v":305673.53225360962}]
[22,"2010-06-01",{"$f":"IF(A33>$C$4,\"_\",IFERROR(VLOOKUP(B33,BAZA_LIBOR_WIBOR_KURS!$C$2:$F$145,2,FALSE),C32))","v":9.7000000000000005E-4},0.01,129.05504998568568,355.4264176294372,{"$f":"IF(A33>$C$4,\"_\",$C$9-SUM($F$12:F33))","v":140816.91631967484},{"$f":"IF(A33>$C$4,\"_\",IFERROR(VLOOKUP(B33,BAZA_LIBOR_WIBOR_KURS!$C$2:$F$145,4,FALSE),H32))","v":2.9837285714285717},{"$f":"IF(A33>$C$4,\"_\",IFERROR(VLOOKUP(B33,BAZA_LIBOR_WIBOR_KURS!$C$2:$F$145,3,FALSE),I32))","v":3.8552380952380935E-2},0.02,1445.5611972508884,1491.49,-45.928802749111583,{"$f":"IF(A33>$C$4,\"_\",$C$3-SUM($M$12:M33))","v":305719.4610563587}]
[23,"2010-07-01",{"$f":"IF(A34>$C$4,\"_\",IFERROR(VLOOKUP(B34,BAZA_LIBOR_WIBOR_KURS!$C$2:$F$145,2,FALSE),C33))","v":1.32E-3},0.01,132.83729106155994,353.91786338780554,{"$f":"IF(A34>$C$4,\"_\",$C$9-SUM($F$12:F34))","v":140462.99845628705},{"$f":"IF(A34>$C$4,\"_\",IFERROR(VLOOKUP(B34,BAZA_LIBOR_WIBOR_KURS!$C$2:$F$145,4,FALSE),H33))","v":3.0287954545454552},{"$f":"IF(A34>$C$4,\"_\",IFERROR(VLOOKUP(B34,BAZA_LIBOR_WIBOR_KURS!$C$2:$F$145,3,FALSE),I33))","v":3.8354545454545461E-2},0.02,1474.2817992728092,1486.68,-12.398200727190897,{"$f":"IF(A34>$C$4,\"_\",$C$3-SUM($M$12:M34))","v":305731.85925708589}]
[24,"2010-08-01",{"$f":"IF(A35>$C$4,\"_\",IFERROR(VLOOKUP(B35,BAZA_LIBOR_WIBOR_KURS!$C$2:$F$145,2,FALSE),C34))","v":1.64E-3},0.01,136.24910850259846,352.58486940992594,{"$f":"IF(A35>$C$4,\"_\",$C$9-SUM($F$12:F35))","v":140110.41358687711},{"$f":"IF(A35>$C$4,\"_\",IFERROR(VLOOKUP(B35,BAZA_LIBOR_WIBOR_KURS!$C$2:$F$145,4,FALSE),H34))","v":2.971559090909091},{"$f":"IF(A35>$C$4,\"_\",IFERROR(VLOOKUP(B35,BAZA_LIBOR_WIBOR_KURS!$C$2:$F$145,3,FALSE),I34))","v":3.812272727272728E-2},0.02,1452.5990510112156,1480.83,-28.230948988784348,{"$f":"IF(A35>$C$4,\"_\",$C$3-SUM($M$12:M35))","v":305760.0902060747}]
[25,"2010-09-01",{"$f":"IF(A36>$C$4,\"_\",IFERROR(VLOOKUP(B36,BAZA_LIBOR_WIBOR_KURS!$C$2:$F$145,2,FALSE),C35))","v":1.75E-3},0.01,137.19144663715051,352.3564095759279,{"$f":"IF(A36>$C$4,\"_\",$C$9-SUM($F$12:F36))","v":139758.05717730121},{"$f":"IF(A36>$C$4,\"_\",IFERROR(VLOOKUP(B36,BAZA_LIBOR_WIBOR_KURS!$C$2:$F$145,4,FALSE),H35))","v":3.0223363636363643},{"$f":"IF(A36>$C$4,\"_\",IFERROR(VLOOKUP(B36,BAZA_LIBOR_WIBOR_KURS!$C$2:$F$145,3,FALSE),I35))","v":3.8213636363636366E-2},0.02,1479.5782875730131,1483.28,-3.7017124269868873,{"$f":"IF(A36>$C$4,\"_\",$C$3-SUM($M$12:M36))","v":305763.79191850167}]
[26,"2010-10-01",{"$f":"IF(A37>$C$4,\"_\",IFERROR(VLOOKUP(B37,BAZA_LIBOR_WIBOR_KURS!$C$2:$F$145,2,FALSE),C36))","v":1.74E-3},0.01,136.72996593845969,352.75314687442426,{"$f":"IF(A37>$C$4,\"_\",$C$9-SUM($F$12:F37))","v":139405.30403042678},{"$f":"IF(A37>$C$4,\"_\",IFERROR(VLOOKUP(B37,BAZA_LIBOR_WIBOR_KURS!$C$2:$F$145,4,FALSE),H36))","v":2.9374952380952379},{"$f":"IF(A37>$C$4,\"_\",IFERROR(VLOOKUP(B37,BAZA_LIBOR_WIBOR_KURS!$C$2:$F$145,3,FALSE),I36))","v":3.8323809523809524E-2},0.02,1437.8543130158807,1486.11,-48.255686984119166,{"$f":"IF(A37>$C$4,\"_\",$C$3-SUM($M$12:M37))","v":305812.04760548577}]
[27,"2010-11-01",{"$f":"IF(A38>$C$4,\"_\",IFERROR(VLOOKUP(B38,BAZA_LIBOR_WIBOR_KURS!$C$2:$F$145,2,FALSE),C37))","v":1.6900000000000001E-3},0.01,135.80400034297409,353.35638348291042,{"$f":"IF(A38>$C$4,\"_\",$C$9-SUM($F$12:F38))","v":139051.94764694385},{"$f":"IF(A38>$C$4,\"_\",IFERROR(VLOOKUP(B38,BAZA_LIBOR_WIBOR_KURS!$C$2:$F$145,4,FALSE),H37))","v":2.9434149999999999},{"$f":"IF(A38>$C$4,\"_\",IFERROR(VLOOKUP(B38,BAZA_LIBOR_WIBOR_KURS!$C$2:$F$145,3,FALSE),I37))","v":3.8549999999999987E-2},0.02,1439.802011158866,1492.11,-52.30798884113392,{"$f":"IF(A38>$C$4,\"_\",$C$3-SUM($M$12:M38))","v":305864.35559432692}]
[28,"2010-12-01",{"$f":"IF(A39>$C$4,\"_\",IFERROR(VLOOKUP(B39,BAZA_LIBOR_WIBOR_KURS!$C$2:$F$145,2,FALSE),C38))","v":1.6999999999999999E-3},0.01,135.57564895577028,353.64908834869107,{"$f":"IF(A39>$C$4,\"_\",$C$9-SUM($F$12:F39))","v":138698.29855859518},{"$f":"IF(A39>$C$4,\"_\",IFERROR(VLOOKUP(B39,BAZA_LIBOR_WIBOR_KURS!$C$2:$F$145,4,FALSE),H38))","v":3.1200782608695645},{"$f":"IF(A39>$C$4,\"_\",IFERROR(VLOOKUP(B39,BAZA_LIBOR_WIBOR_KURS!$C$2:$F$145,3,FALSE),I38))","v":3.9152173913043486E-2},0.02,1526.4194675432732,1507.71,18.709467543273149,{"$f":"IF(A39>$C$4,\"_\",$C$3-SUM($M$12:M39))","v":305845.64612678369}]
[29,"2011-01-01",{"$f":"IF(A40>$C$4,\"_\",IFERROR(VLOOKUP(B40,BAZA_LIBOR_WIBOR_KURS!$C$2:$F$145,2,FALSE),C39))","v":1.6900000000000001E-3},0.01,135.11525917916481,354.04530635832492,{"$f":"IF(A40>$C$4,\"_\",$C$9-SUM($F$12:F40))","v":138344.25325223684},{"$f":"IF(A40>$C$4,\"_\",IFERROR(VLOOKUP(B40,BAZA_LIBOR_WIBOR_KURS!$C$2:$F$145,4,FALSE),H39))","v":3.0455049999999999},{"$f":"IF(A40>$C$4,\"_\",IFERROR(VLOOKUP(B40,BAZA_LIBOR_WIBOR_KURS!$C$2:$F$145,3,FALSE),I39))","v":4.0104999999999995E-2},0.02,1489.7409481472525,1531.9,-42.159051852747552,{"$f":"IF(A40>$C$4,\"_\",$C$3-SUM($M$12:M40))","v":305887.80517863639}]
{"$rows_left_out":452}
{"sheet":"BAZA_LIBOR_WIBOR_KURS","index":1,"n_rows":145,"n_cols":10,"rows_kept":145,"cut":false,"hidden":false,"merged":[]}
["Rok","miesiąc","Data","LIBOR_3M_CHF","WIBOR_3M","Kurs PLN/CHF"]
[2005,1,{"$f":"DATE(A2,B2,1)","v":"2005-01-01"},7.3899999999999999E-3,6.6314285714285728E-2,2.638757142857143,null,2005,"styczeń",1]
[2005,2,"2005-02-01",7.5199999999999998E-3,6.5409999999999982E-2,2.5710299999999995,null,2006,"luty",2]
[2005,3,"2005-03-01",7.5399999999999998E-3,6.1545454545454542E-2,2.5933227272727275,null,2007,"marzec",3]
[2005,4,"2005-04-01",7.6499999999999997E-3,5.7764999999999997E-2,2.6861350000000002,null,2008,"kwiecień",4]
[2005,5,"2005-05-01",7.5500000000000003E-3,5.4815000000000003E-2,2.7052749999999999,null,2009,"maj",5]
[2005,6,"2005-06-01",7.4900000000000001E-3,5.2181818181818176E-2,2.6393318181818177,null,2010,"czerwiec",6]
[2005,7,"2005-07-01",7.4900000000000001E-3,4.6809523809523801E-2,2.6309952380952386,null,2011,"lipiec",7]
[2005,8,"2005-08-01",7.5900000000000004E-3,4.674090909090909E-2,2.6043636363636371,null,2012,"sierpień",8]
[2005,9,"2005-09-01",7.62E-3,4.513181818181819E-2,2.5313181818181816,null,2013,"wrzesień",9]
[2005,10,"2005-10-01",8.1200000000000005E-3,4.5452380952380959E-2,2.5312000000000001,null,2014,"październik",10]
[2005,11,"2005-11-01",9.5300000000000003E-3,4.6384999999999996E-2,2.5672600000000001,null,2015,"listopad",11]
[2005,12,"2005-12-01",1.023E-2,4.6166666666666682E-2,2.4891857142857146,null,2016,"grudzień",12]
[2006,1,"2006-01-01",1.008E-2,4.4863636363636369E-2,2.4668818181818177]
[2006,2,"2006-02-01",1.089E-2,4.2615E-2,2.4356049999999998]
[2006,3,"2006-03-01",1.2109999999999999E-2,4.1213043478260866E-2,2.4734347826086958]
[2006,4,"2006-04-01",1.281E-2,4.1400000000000006E-2,2.4884578947368419]
[2006,5,"2006-05-01",1.406E-2,4.1538095238095228E-2,2.5053666666666667]
[2006,6,"2006-06-01",1.481E-2,4.1747619047619047E-2,2.5767523809523816]
[2006,7,"2006-07-01",1.5299999999999999E-2,4.1933333333333322E-2,2.5478952380952373]
[2006,8,"2006-08-01",1.6109999999999999E-2,4.1940909090909112E-2,2.4753272727272728]
[2006,9,"2006-09-01",1.737E-2,4.2090476190476199E-2,2.5061285714285715]
[2006,10,"2006-10-01",1.8450000000000001E-2,4.2168181818181834E-2,2.45505]
[2006,11,"2006-11-01",1.9009999999999999E-2,4.197142857142859E-2,2.4017999999999993]
[2006,12,"2006-12-01",2.017E-2,4.1994736842105272E-2,2.3869684210526319]
[2007,1,"2007-01-01",2.1489999999999999E-2,4.1972727272727287E-2,2.4003272727272726]
[2007,2,"2007-02-01",2.2120000000000001E-2,4.198000000000001E-2,2.402145]
[2007,3,"2007-03-01",2.2589999999999999E-2,4.2172727272727271E-2,2.410077272727273]
[2007,4,"2007-04-01",2.3189999999999999E-2,4.3164999999999995E-2,2.3317600000000001]
[2007,5,"2007-05-01",2.4109999999999999E-2,4.4390476190476189E-2,2.2918761904761906]
[2007,6,"2007-06-01",2.546E-2,4.5150000000000003E-2,2.300335]
[2007,7,"2007-07-01",2.716E-2,4.7804545454545461E-2,2.2740318181818187]
[2007,8,"2007-08-01",2.7959999999999999E-2,4.9086363636363629E-2,2.3273727272727274]
[2007,9,{"$f":"DATE(A34,B34,1)","v":"2007-09-01"},2.8240000000000001E-2,5.0909999999999997E-2,2.2997249999999996]
[2007,10,"2007-10-01",2.7869999999999999E-2,5.128695652173914E-2,2.2189869565217393]
[2007,11,"2007-11-01",2.751E-2,5.3638095238095228E-2,2.2200523809523811]
[2007,12,"2007-12-01",2.7740000000000001E-2,5.666842105263159E-2,2.1712894736842108]
[2008,1,"2008-01-01",2.6960000000000001E-2,5.6427272727272722E-2,2.2278000000000002]
[2008,2,"2008-02-01",2.7449999999999999E-2,5.7428571428571419E-2,2.224019047619048]
[2008,3,"2008-03-01",2.8289999999999999E-2,6.0264999999999999E-2,2.2520199999999999]
{"$rows_left_out":105}